BDBM23143 2,4-dihydroxy-3-(piperidin-1-ylmethyl)benzaldehyde::aldehyde derivative, 2c
SMILES Oc1ccc(C=O)c(O)c1CN1CCCCC1
InChI Key InChIKey=PLAGHJZNFKBREB-UHFFFAOYSA-N
Data  1 IC50
  Tab Delimited (TSV)   2D SDfile   Computed 3D by Vconf -m prep SDfile
Find this compound or compounds like it in BindingDB:
Activity Spreadsheet -- Enzyme Inhibition Constant Data from BindingDB
Found 1 hit for monomerid = 23143
TargetFalcipain 2(Plasmodium falciparum)
University Of Cape Town
LigandPNGBDBM23143(2,4-dihydroxy-3-(piperidin-1-ylmethyl)benzaldehyde...)
Affinity DataIC50: >2.00E+4nMpH: 5.5 T: 2°C. Assay description: IC50 values against the recombinant falcipain-2 were determined by incubating protein with different concentrations of inhibitors in reaction buffer ...
In DepthDetails ArticlePubMed