BDBM231461 US9346798, 208
SMILES OC[C@@H](O)Cc1cc(ccc1N1CCOc2cc(ccc12)S(=O)(=O)Nc1nccs1)C(F)(F)F
InChI Key InChIKey=NGDMDSQQEVAVIN-HNNXBMFYSA-N
Data  3 IC50
  Tab Delimited (TSV)   2D SDfile   Computed 3D by Vconf -m prep SDfile
Find this compound or compounds like it in BindingDB:
Activity Spreadsheet -- Enzyme Inhibition Constant Data from BindingDB
Found 3 hits for monomerid = 231461
TargetSodium channel protein type 5 subunit alpha(Homo sapiens (Human))
Amgen
US Patent
LigandPNGBDBM231461(US9346798, 208)
Affinity DataIC50:  896nM. Assay description: HEK 293 cells stably transfected with either Nav 1.7 or with Nav 1.5 were recorded in population patch-clamp mode with the IonWorks® Quattro auto...
Ligand InfoPC cidPC sid
In DepthDetails US Patent
TargetSodium channel protein type 9 subunit alpha(Homo sapiens (Human))
Amgen
US Patent
LigandPNGBDBM231461(US9346798, 208)
Affinity DataIC50:  258nM. Assay description: HEK 293 cells stably transfected with human Nav1.7 were recorded in whole cell voltage clamp mode with the PatchXpress automated electrophysiology sy...
Ligand InfoPC cidPC sid
In DepthDetails US Patent
TargetSodium channel protein type 9 subunit alpha(Homo sapiens (Human))
Amgen
US Patent
LigandPNGBDBM231461(US9346798, 208)
Affinity DataIC50:  18.5nM. Assay description: HEK 293 cells stably transfected with either Nav 1.7 or with Nav 1.5 were recorded in population patch-clamp mode with the IonWorks® Quattro auto...
Ligand InfoPC cidPC sid
In DepthDetails US Patent