BDBM231502 6-Cyano-7-(4-((S)-2-phenylpropylcarbamoyl)phenoxy)chroman-4-carboxylic acid::US9556139, 131
SMILES C[C@H](CNC(=O)c1ccc(Oc2cc3OCCC(C(O)=O)c3cc2C#N)cc1)c1ccccc1
InChI Key InChIKey=QXEHSJITCGJTTM-PLEWWHCXSA-N
Data  1 EC50
  Tab Delimited (TSV)   2D SDfile   Computed 3D by Vconf -m prep SDfile
Find this compound or compounds like it in BindingDB:
Activity Spreadsheet -- Enzyme Inhibition Constant Data from BindingDB
Found 1 hit for monomerid = 231502
TargetProstaglandin D2 receptor 2(Homo sapiens (Human))
Array Biopharma
US Patent
LigandPNGBDBM231502(6-Cyano-7-(4-((S)-2-phenylpropylcarbamoyl)phenoxy)...)
Affinity DataEC50:  59.3nMpH: 7.4 T: 2°C. Assay description: The coding sequence of human DP2 was introduced into the human Leukemic cell line K562 by electroporation and stable clones expressing DP2 were obtai...
Ligand InfoPC cidPC sid
In DepthDetails US Patent