BDBM231530 US9346818, I-15
SMILES CC1(C)N(CCC2CCN(Cc3cccc(F)c3)CC2)C(=O)c2cc3OCOc3cc12
InChI Key InChIKey=KOMHSVJXJNYXNC-UHFFFAOYSA-N
Data  1 IC50
  Tab Delimited (TSV)   2D SDfile   Computed 3D by Vconf -m prep SDfile
Find this compound or compounds like it in BindingDB:
Activity Spreadsheet -- Enzyme Inhibition Constant Data from BindingDB
Found 1 hit for monomerid = 231530
TargetAcetylcholinesterase(Mus musculus (mouse))
Zhejiang Hisun Pharmaceutical
US Patent
LigandPNGBDBM231530(US9346818, I-15)
Affinity DataIC50: >2.00E+3nM. Assay description: Modified Ellman method (Alvin V. et al. JWS-USC-75-IX Improves Information Processing and Cognitive Function in Animal Models[J]. Journal of Pharmaco...
Ligand InfoPC cidPC sid
In DepthDetails US Patent