BDBM231545 US9346818, I-30
SMILES O=C1N(CCC2CCN(Cc3cccnc3)CC2)C2(CC2)c2cc3OCOc3cc12
InChI Key InChIKey=JIXQNRKKJKCXCL-UHFFFAOYSA-N
Data  1 IC50
  Tab Delimited (TSV)   2D SDfile   Computed 3D by Vconf -m prep SDfile
Find this compound or compounds like it in BindingDB:
Activity Spreadsheet -- Enzyme Inhibition Constant Data from BindingDB
Found 1 hit for monomerid = 231545
TargetAcetylcholinesterase(Mus musculus (mouse))
Zhejiang Hisun Pharmaceutical
US Patent
LigandPNGBDBM231545(US9346818, I-30)
Affinity DataIC50: >2.00E+3nM. Assay description: Modified Ellman method (Alvin V. et al. JWS-USC-75-IX Improves Information Processing and Cognitive Function in Animal Models[J]. Journal of Pharmaco...
Ligand InfoPC cidPC sid
In DepthDetails US Patent