BDBM231580 US9345700, 15
SMILES O=C(Nc1cccnc1)c1cc(nc2ccc(cc12)-c1ccc2cc[nH]c2c1)-c1ccco1
InChI Key InChIKey=FZPOCJMMEQMHDZ-UHFFFAOYSA-N
Data  1 IC50
  Tab Delimited (TSV)   2D SDfile   Computed 3D by Vconf -m prep SDfile
Find this compound or compounds like it in BindingDB:
Activity Spreadsheet -- Enzyme Inhibition Constant Data from BindingDB
Found 1 hit for monomerid = 231580
TargetInduced myeloid leukemia cell differentiation protein Mcl-1(Homo sapiens (Human))
Eutropics Pharmaceuticals
US Patent
LigandPNGBDBM231580(US9345700, 15)
Affinity DataIC50:  2.40E+3nM. Assay description: A streptavidin-coated plate (Thermo Scientific, NUNC #436014) was washed three times with 300 μL of PBS-0.05% Tween solution. A biotinylated twent...
Ligand InfoPC cidPC sid
In DepthDetails US Patent