BDBM231589 US9345700, 24
SMILES O=C(Nc1cccnc1)c1cc(nc2ccc(Nc3ccccn3)cc12)-c1ccco1
InChI Key InChIKey=XQQOKGWFWLGQTB-UHFFFAOYSA-N
Data  1 IC50
  Tab Delimited (TSV)   2D SDfile   Computed 3D by Vconf -m prep SDfile
Find this compound or compounds like it in BindingDB:
Activity Spreadsheet -- Enzyme Inhibition Constant Data from BindingDB
Found 1 hit for monomerid = 231589
TargetInduced myeloid leukemia cell differentiation protein Mcl-1(Homo sapiens (Human))
Eutropics Pharmaceuticals
US Patent
LigandPNGBDBM231589(US9345700, 24)
Affinity DataIC50:  8.60E+3nM. Assay description: A streptavidin-coated plate (Thermo Scientific, NUNC #436014) was washed three times with 300 μL of PBS-0.05% Tween solution. A biotinylated twent...
Ligand InfoPC cidPC sid
In DepthDetails US Patent