BDBM231623 PT159
SMILES CCCCCCc1cc(=O)c(Cc2ccccc2C#N)cn1C
InChI Key InChIKey=BIDQBMCKKWXMCQ-UHFFFAOYSA-N
Data  1 KI
  Tab Delimited (TSV)   2D SDfile   Computed 3D by Vconf -m prep SDfile
Find this compound or compounds like it in BindingDB:
Activity Spreadsheet -- Enzyme Inhibition Constant Data from BindingDB
Found 1 hit for monomerid = 231623
TargetEnoyl-[acyl-carrier-protein] reductase [NADPH] FabI(Staphylococcus aureus)
University Of Wuerzburg
LigandPNGBDBM231623(PT159)
Affinity DataKi:  11nMpH: 7.5Assay Description:Kinetics were performed on a Cary 100 spectrophotometer (Varian) at 20 °C. Reaction velocities were measured by monitoring the oxidation of NAD(P)H t...
Ligand InfoPC cidPC sid
In DepthDetails ArticlePubMed