BDBM23166 1,2-benzoxazol-3-ol::benzo[d]isoxazol-3-ol
SMILES O=c1[nH]oc2ccccc12
InChI Key InChIKey=QLDQYRDCPNBPII-UHFFFAOYSA-N
Data  1 IC50
  Tab Delimited (TSV)   2D SDfile   Computed 3D by Vconf -m prep SDfile
Find this compound or compounds like it in BindingDB:
Activity Spreadsheet -- Enzyme Inhibition Constant Data from BindingDB
Found 1 hit for monomerid = 23166
TargetD-amino-acid oxidase(Sus scrofa (pig))
Mgi Pharma
LigandPNGBDBM23166(1,2-benzoxazol-3-ol | benzo[d]isoxazol-3-ol)
Affinity DataIC50:  1.88E+3nMpH: 8.5 T: 2°C. Assay description: D-amino acid oxidase (DAAO) was assayed in a 96-well plate format. D-serine was oxidatively deaminated by porcine D-amino acid oxidase in the presenc...
In DepthDetails ArticlePubMed