BDBM231735 US9340517, 121
SMILES NCCCC[C@@H]1N[C@H](CNC(=O)c2ccc(cc2)-c2ccccc2)CCN(Cc2ccc3ccccc3c2)C1=O
InChI Key InChIKey=IWRGOUKRYWLQAR-ACHIHNKUSA-N
Data  1 IC50
  Tab Delimited (TSV)   2D SDfile   Computed 3D by Vconf -m prep SDfile
Find this compound or compounds like it in BindingDB:
Activity Spreadsheet -- Enzyme Inhibition Constant Data from BindingDB
Found 1 hit for monomerid = 231735
TargetMelanocortin receptor 5(Homo sapiens (Human))
Mimetica
US Patent
LigandPNGBDBM231735(US9340517, 121)
Affinity DataIC50: <1.00E+3nMpH: 7.4 T: 2°C. Assay description: Assessments of compound binding to human MC5R (hMC5R)) by displacement of an 125I-labeled NDP-MSH receptor ligand peptide were performed essentially ...
Ligand InfoPC cidPC sid
In DepthDetails US Patent