BDBM232009 US9340517, 397
SMILES Clc1ccc(\C=C\C(=O)NC[C@H]2CCN(CC(c3ccccc3)c3ccccc3)C(=O)[C@@H](CCN3CCCC3)N2)cc1
InChI Key InChIKey=KNHJCOXBCSOUDJ-WPLHFAGHSA-N
Data  1 IC50
  Tab Delimited (TSV)   2D SDfile   Computed 3D by Vconf -m prep SDfile
Find this compound or compounds like it in BindingDB:
Activity Spreadsheet -- Enzyme Inhibition Constant Data from BindingDB
Found 1 hit for monomerid = 232009
TargetMelanocortin receptor 5(Homo sapiens (Human))
Mimetica
US Patent
LigandPNGBDBM232009(US9340517, 397)
Affinity DataIC50: <100nMpH: 7.4 T: 2°C. Assay description: Assessments of compound binding to human MC5R (hMC5R)) by displacement of an 125I-labeled NDP-MSH receptor ligand peptide were performed essentially ...
Ligand InfoPC cidPC sid
In DepthDetails US Patent