BDBM23201 (1S,2R,4aS,6aS,6bR,10R,11S,12aR,12bR,14bS)-10,11-dihydroxy-1,2,6a,6b,9,9,12a-heptamethyl-1,2,3,4,4a,5,6,6a,6b,7,8,8a,9,10,11,12,12a,12b,13,14b-icosahydropicene-4a-carboxylic acid::2-Epicorosolic Acid, 14::pentacyclic triterpene compound 14
SMILES [H][C@@]12[C@@H](C)[C@H](C)CC[C@@]1(CC[C@]1(C)C2=CC[C@]2([H])[C@@]3(C)C[C@H](O)[C@H](O)C(C)(C)C3CC[C@@]12C)C(O)=O
InChI Key InChIKey=HFGSQOYIOKBQOW-KAWLLTQNSA-N
Data  1 IC50
  Tab Delimited (TSV)   2D SDfile   Computed 3D by Vconf -m prep SDfile
Find this compound or compounds like it in BindingDB:
Activity Spreadsheet -- Enzyme Inhibition Constant Data from BindingDB
Found 1 hit for monomerid = 23201
TargetGlycogen phosphorylase, muscle form(Oryctolagus cuniculus (rabbit))
China Pharmaceutical University
LigandPNGBDBM23201((1S,2R,4aS,6aS,6bR,10R,11S,12aR,12bR,14bS)-10,11-d...)
Affinity DataIC50:  1.16E+5nMpH: 7.2 T: 2°C. Assay description: The activity of the compounds is determined by measuring the inhibitory effect of the compounds in the direction of glycogen synthesis, the conversio...
In DepthDetails ArticlePubMed