BDBM232215 N-4-fluorobenzoyl-L-leucine-γ-aminobutyric acid benzyl ester (11)::N-pentafluorobenzoyl-L-leucine-γ-aminobutyric acid benzyl ester (12)
SMILES CC(C)C[C@H](NC(=O)c1ccc(F)cc1)C(=O)NCCCC(=O)Oc1ccccc1
InChI Key InChIKey=MCDKQMXZXMSSLE-FQEVSTJZSA-N
Data  2 IC50
  Tab Delimited (TSV)   2D SDfile   Computed 3D by Vconf -m prep SDfile
Find this compound or compounds like it in BindingDB:
Activity Spreadsheet -- Enzyme Inhibition Constant Data from BindingDB
Found 2 hits for monomerid = 232215
TargetSecreted cathepsin L 1(Fasciola hepatica (Liver fluke))
Dublin City University
LigandPNGBDBM232215(N-4-fluorobenzoyl-L-leucine-γ-aminobutyric ac...)
Affinity DataIC50:  2.14E+4nM. Assay description: The protease was activated by the addition of dithiothreitol, ethylenediaminetetraacetic acid (EDTA), and sodium acetate followed by incubation at 37...
Ligand InfoPC cidPC sid
In DepthDetails ArticlePubMed
TargetSecreted cathepsin L 1(Fasciola hepatica (Liver fluke))
Dublin City University
LigandPNGBDBM232215(N-4-fluorobenzoyl-L-leucine-γ-aminobutyric ac...)
Affinity DataIC50:  1.93E+4nM. Assay description: The protease was activated by the addition of dithiothreitol, ethylenediaminetetraacetic acid (EDTA), and sodium acetate followed by incubation at 37...
Ligand InfoPC cidPC sid
In DepthDetails ArticlePubMed