BDBM232282 US9345742, 40
SMILES CCc1cccc(CC)c1NC(=O)C[C@H](N)[C@H](Cc1ccccc1)NC(=O)[C@@H](NC(=O)CCCc1ccccc1)C(C)C
InChI Key InChIKey=SBFCHYUPNJWUIM-JHFJJOSTSA-N
Data  1 IC50
  Tab Delimited (TSV)   2D SDfile   Computed 3D by Vconf -m prep SDfile
Find this compound or compounds like it in BindingDB:
Activity Spreadsheet -- Enzyme Inhibition Constant Data from BindingDB
Found 1 hit for monomerid = 232282
TargetCathepsin D(Homo sapiens (Human))
Merck Patent
US Patent
LigandPNGBDBM232282(US9345742, 40)
Affinity DataIC50:  800nMpH: 5.5 T: 2°C. Assay description: In order to identify modulators of cathepsin D activity, a continuous enzymatic test was carried out with a synthetic peptide which carries a fluores...
Ligand InfoPC cidPC sid
In DepthDetails US Patent