BDBM23231 7-{2-[3-cyano-4-(formamidoformic acid)phenyl]ethoxy}-5-hydroxy-4-oxo-4H-chromene-2-carboxylic acid::Oxamic acid derivative, 3
SMILES OC(=O)C(=O)Nc1ccc(CCOc2cc(O)c3c(c2)oc(cc3=O)C(O)=O)cc1C#N
InChI Key InChIKey=PXBBGVBSWVBFNE-UHFFFAOYSA-N
Data  2 IC50
  Tab Delimited (TSV)   2D SDfile   Computed 3D by Vconf -m prep SDfile
Find this compound or compounds like it in BindingDB:
Activity Spreadsheet -- Enzyme Inhibition Constant Data from BindingDB
Found 2 hits for monomerid = 23231
TargetMalate dehydrogenase, cytoplasmic(Sus scrofa (pig))
University Of Mississippi
LigandPNGBDBM23231(7-{2-[3-cyano-4-(formamidoformic acid)phenyl]ethox...)
Affinity DataIC50:  1.36E+4nM. Assay description: MDH was assayed spectrophotometrically for reduction of oxaloacetic acid using NADH by recording the changed in absorbance at 340 nm. The reaction wa...
In DepthDetails ArticlePubMed
TargetMalate dehydrogenase, mitochondrial(Sus scrofa (pig))
University Of Mississippi
LigandPNGBDBM23231(7-{2-[3-cyano-4-(formamidoformic acid)phenyl]ethox...)
Affinity DataIC50:  1.71E+4nM. Assay description: MDH was assayed spectrophotometrically for reduction of oxaloacetic acid using NADH by recording the changed in absorbance at 340 nm. The reaction wa...
In DepthDetails ArticlePubMed