BDBM232350 US9346794, 56
SMILES Cc1c(-c2cccc(c2)C(F)(F)F)c(=O)c(cn1-c1nccs1)C(=O)NCc1ccc(cc1)S(C)(=O)=NC#N
InChI Key InChIKey=ULRXYYIWBULQDH-UHFFFAOYSA-N
Data  1 IC50
  Tab Delimited (TSV)   2D SDfile   Computed 3D by Vconf -m prep SDfile
Find this compound or compounds like it in BindingDB:
Activity Spreadsheet -- Enzyme Inhibition Constant Data from BindingDB
Found 1 hit for monomerid = 232350
TargetNeutrophil elastase(Homo sapiens (Human))
Boehringer Ingelheim International
US Patent
LigandPNGBDBM232350(US9346794, 56)
Affinity DataIC50:  3.10nMpH: 7.5 T: 2°C. Assay description: The following buffers were used: Compound buffer: 100 mM Tris, 500 mM NaCl, adjusted to pH 7.5; Assay buffer: 100 mM Tris, 500 mM NaCl, adjusted to p...
Ligand InfoPC cidPC sid
In DepthDetails US Patent