BDBM232385 US9346795, 10
SMILES CCCCN(CCCC)C(=O)c1nn(c(C)c1Cl)-c1ccc(cc1C(=O)N1CCc2ccccc2C1)C(=O)NS(=O)(=O)c1ccc2ccc(Cl)cc2c1
InChI Key InChIKey=GPHWUGRPNVYARD-UHFFFAOYSA-N
Data  2 IC50
  Tab Delimited (TSV)   2D SDfile   Computed 3D by Vconf -m prep SDfile
Find this compound or compounds like it in BindingDB:
Activity Spreadsheet -- Enzyme Inhibition Constant Data from BindingDB
Found 2 hits for monomerid = 232385
TargetBcl-2-like protein 1(Homo sapiens (Human))
Bristol-Myers Squibb
US Patent
LigandPNGBDBM232385(US9346795, 10)
Affinity DataIC50:  90nMT: 2°C. Assay description: The assays were performed in black flat-bottom 384-well plates. The final assay volume was 55 μl prepared from additions of Biotin-Bcl-xL (Bcl-x...
Ligand InfoPC cidPC sid
In DepthDetails US Patent
TargetApoptosis regulator Bcl-2(Homo sapiens (Human))
Bristol-Myers Squibb
US Patent
LigandPNGBDBM232385(US9346795, 10)
Affinity DataIC50:  90nMT: 2°C. Assay description: The assays were performed in black flat-bottom 384-well plates. The final assay volume was 50 μl prepared from additions of Gst-Bcl-2 (Bcl-2: GE...
Ligand InfoPC cidPC sid
In DepthDetails US Patent