BDBM232958 US9353113, 7(45)::US9862721, 7(45)
SMILES OC(=O)C1=CCN(CC(=O)N2CCc3c(C2)n(Cc2ccc(s2)C(F)(F)F)c2ncccc32)CC1
InChI Key InChIKey=SFIPXIQGOUVZJK-UHFFFAOYSA-N
Data  2 IC50
  Tab Delimited (TSV)   2D SDfile   Computed 3D by Vconf -m prep SDfile
Find this compound or compounds like it in BindingDB:
Activity Spreadsheet -- Enzyme Inhibition Constant Data from BindingDB
Found 2 hits for monomerid = 232958
TargetEctonucleotide pyrophosphatase/phosphodiesterase family member 2(Homo sapiens (Human))
Ono Pharmaceutical
US Patent
LigandPNGBDBM232958(US9353113, 7(45) | US9862721, 7(45))
Affinity DataIC50:  16nM. Assay description: 10 μL of a test compound solution (10% dimethyl sulfoxide) at each concentration and 40 μL of a 5 μg/mL human ENPP2 solution (buffer A...
Ligand InfoPC cidPC sid
In DepthDetails US Patent
TargetEctonucleotide pyrophosphatase/phosphodiesterase family member 2(Homo sapiens (Human))
Ono Pharmaceutical
US Patent
LigandPNGBDBM232958(US9353113, 7(45) | US9862721, 7(45))
Affinity DataIC50:  16nMpH: 9.0Assay Description:10 μL of a test compound solution (10% dimethyl sulfoxide) at each concentration and 40 μL of a 5 μg/mL human ENPP2 solution (buffer A...
Ligand InfoPC cidPC sid
In DepthDetails US Patent