BDBM232966 US9353115, 54
SMILES CCN1CCN(CC1)c1ccc(cc1)-c1nc(NCCN2CCOCC2)c2nc[nH]c2n1
InChI Key InChIKey=HNOXDNGNMDRDGE-UHFFFAOYSA-N
Data  1 IC50
  Tab Delimited (TSV)   2D SDfile   Computed 3D by Vconf -m prep SDfile
Find this compound or compounds like it in BindingDB:
Activity Spreadsheet -- Enzyme Inhibition Constant Data from BindingDB
Found 1 hit for monomerid = 232966
TargetToll-like receptor 9(Homo sapiens (Human))
Janus Biotherapeutics
US Patent
LigandPNGBDBM232966(US9353115, 54)
Affinity DataIC50:  142nMT: 2°C. Assay description: Day 1: A cell suspension of HEK-Blue™-hTLR9 cells at ~450,000 cells per ml in test medium which contained 5% (v/v) heat inactivated FBS was pre...
Ligand InfoPC cidPC sid
In DepthDetails US Patent