BDBM232971 US9353115, 59
SMILES C(CN1CCOCC1)Nc1nc(nc2n(CCN3CCOCC3)cnc12)-c1ccccc1
InChI Key InChIKey=YPAWSBBHAVCDMX-UHFFFAOYSA-N
Data  1 IC50
  Tab Delimited (TSV)   2D SDfile   Computed 3D by Vconf -m prep SDfile
Find this compound or compounds like it in BindingDB:
Activity Spreadsheet -- Enzyme Inhibition Constant Data from BindingDB
Found 1 hit for monomerid = 232971
TargetToll-like receptor 9(Homo sapiens (Human))
Janus Biotherapeutics
US Patent
LigandPNGBDBM232971(US9353115, 59)
Affinity DataIC50:  7.53E+3nMT: 2°C. Assay description: Day 1: A cell suspension of HEK-Blue™-hTLR9 cells at ~450,000 cells per ml in test medium which contained 5% (v/v) heat inactivated FBS was pre...
Ligand InfoPC cidPC sid
In DepthDetails US Patent