BDBM233120 Xanthatin-1,5β-epoxide (4)
SMILES C[C@H]1C[C@@H]2OC(=O)C(=C)[C@H]2C[C@@H]2O[C@]12\C=C\C(C)=O
InChI Key InChIKey=NGAVJIMZMAIVPV-SOFYJNGRSA-N
Data  1 IC50
  Tab Delimited (TSV)   2D SDfile   Computed 3D by Vconf -m prep SDfile
Find this compound or compounds like it in BindingDB:
Activity Spreadsheet -- Enzyme Inhibition Constant Data from BindingDB
Found 1 hit for monomerid = 233120
TargetRas-like protein 2(Saccharomyces cerevisiae (Baker's yeast))
Ufr Des Sciences Pharmaceutiques Et Ingenierie De La Sante
LigandPNGBDBM233120(Xanthatin-1,5β-epoxide (4))
Affinity DataIC50:  5.00E+5nMpH: 7.5 T: 2°C. Assay description: Assays were realized on 96-well plates, prepared with Biomek NKMC and Biomek 3000 from Beckman Coulter and read on a Wallac Victor fluorimeter from P...
Ligand InfoPC cidPC sid
In DepthDetails ArticlePubMed