BDBM23326 1-[(2S)-2-[5,5-bis(4-fluorophenyl)pentanoyl]pyrrolidin-1-yl]-3,3-dimethylpentane-1,2-dione::N-Glyoxylprolyl ketone, 5i
SMILES CCC(C)(C)C(=O)C(=O)N1CCC[C@H]1C(=O)CCCC(c1ccc(F)cc1)c1ccc(F)cc1
InChI Key InChIKey=AIVSIPTYNHWBTO-DEOSSOPVSA-N
Data  1 KI
  Tab Delimited (TSV)   2D SDfile   Computed 3D by Vconf -m prep SDfile
Find this compound or compounds like it in BindingDB:
Activity Spreadsheet -- Enzyme Inhibition Constant Data from BindingDB
Found 1 hit for monomerid = 23326
TargetPeptidyl-prolyl cis-trans isomerase FKBP1A(Bos taurus (bovine))
Guilford Pharmaceuticals
LigandPNGBDBM23326(1-[(2S)-2-[5,5-bis(4-fluorophenyl)pentanoyl]pyrrol...)
Affinity DataKi:  460nM ΔG°:  -7.91kcal/molepH: 8.0 T: 2°C. Assay description: PPIase(Rotamase) activity of FKBP12 was assayed using the peptide N-succinyl Ala-Leu-Pro-Phe p-nitroanilide as substrate. It is based on the observat...
Ligand InfoPC cidPC sid
In DepthDetails ArticlePubMed