BDBM233286 US9346786, 90
SMILES CCN([C@@H]1CN(C[C@H]1c1ccc(Cl)cc1)C(=O)C1CCN(CC1)C(=O)C1CC(F)(F)C1)C(=O)Oc1ccc(F)cc1
InChI Key InChIKey=CRDSCASYQLZDRJ-IZZNHLLZSA-N
Data  1 KI
  Tab Delimited (TSV)   2D SDfile   Computed 3D by Vconf -m prep SDfile
Find this compound or compounds like it in BindingDB:
Activity Spreadsheet -- Enzyme Inhibition Constant Data from BindingDB
Found 1 hit for monomerid = 233286
TargetNeuromedin-K receptor(Homo sapiens (Human))
Hoffmann-La Roche
US Patent
LigandPNGBDBM233286(US9346786, 90)
Affinity DataKi:  2.40nM ΔG°:  -10.9kcal/molepH: 7.4 T: 2°C. Assay description: hNK3 receptor binding experiment were performed using [3H]SR142801 (Catalog No. TRK1035, specific activity: 74.0 Ci/mmol, Amersham, GE Healthcare UK ...
Ligand InfoPC cidPC sid
In DepthDetails US Patent