BDBM23350 1-(4-chlorophenyl)-2-{4,6-dimethoxy-12-oxo-11,17-diazatetracyclo[11.3.1.0^{2,11}.0^{3,8}]heptadeca-3(8),4,6-trien-17-yl}ethane-1,2-dione::Tetracyclic aza-amide, 6f
SMILES COc1cc2CCN3C(C4CCCC(N4C(=O)C(=O)c4ccc(Cl)cc4)C3=O)c2c(OC)c1
InChI Key InChIKey=QEXRBLBPEYFLTC-UHFFFAOYSA-N
Data  1 KI
  Tab Delimited (TSV)   2D SDfile   Computed 3D by Vconf -m prep SDfile
Find this compound or compounds like it in BindingDB:
Activity Spreadsheet -- Enzyme Inhibition Constant Data from BindingDB
Found 1 hit for monomerid = 23350
TargetPeptidyl-prolyl cis-trans isomerase FKBP1A(Homo sapiens (Human))
Pfizer
LigandPNGBDBM23350(1-(4-chlorophenyl)-2-{4,6-dimethoxy-12-oxo-11,17-d...)
Affinity DataKi:  72nM ΔG°:  -9.41kcal/molepH: 8.0 T: 2°C. Assay description: PPIase(Rotamase) activity of FKBP12 was assayed using the peptide N-succinyl Ala-Leu-Pro-Phe p-nitroanilide as substrate. It is based on the observat...
In DepthDetails ArticlePubMed