BDBM233507 US9351965, 114
SMILES Cc1cc(ccn1)-c1n[nH]c2ccc(cc12)C(=O)NC1CCCC(Cn2ncc3cccnc23)C1
InChI Key
Data  1 IC50
  Tab Delimited (TSV)   2D SDfile   Computed 3D by Vconf -m prep SDfile
Find this compound or compounds like it in BindingDB:
Activity Spreadsheet -- Enzyme Inhibition Constant Data from BindingDB
Found 1 hit for monomerid = 233507
TargetMitogen-activated protein kinase 1(Mus musculus (Mouse))
Merck Sharp & Dohme
US Patent
LigandPNGBDBM233507(US9351965, 114)
Affinity DataIC50:  15.4nM. Assay description: Activated ERK2 activity was also determined in the IMAP assay format using the procedure outlined above. 1 μl of 25× compound was added to 1...
Ligand InfoPC cidPC sid
In DepthDetails US Patent