BDBM233509 US9351965, 116
SMILES Cc1nc2cnccc2n1CC1CCCC(C1)NC(=O)c1ccc2[nH]nc(-c3ccnc(C)c3)c2c1
InChI Key
Data  1 IC50
  Tab Delimited (TSV)   2D SDfile   Computed 3D by Vconf -m prep SDfile
Find this compound or compounds like it in BindingDB:
Activity Spreadsheet -- Enzyme Inhibition Constant Data from BindingDB
Found 1 hit for monomerid = 233509
TargetMitogen-activated protein kinase 1(Mus musculus (Mouse))
Merck Sharp & Dohme
US Patent
LigandPNGBDBM233509(US9351965, 116)
Affinity DataIC50:  1.00E+3nM. Assay description: Activated ERK2 activity was also determined in the IMAP assay format using the procedure outlined above. 1 μl of 25× compound was added to 1...
Ligand InfoPC cidPC sid
In DepthDetails US Patent