BDBM23379 17-(benzenesulfonyl)-4,6-dimethoxy-11,17-diazatetracyclo[11.3.1.0^{2,11}.0^{3,8}]heptadeca-3(8),4,6-trien-12-one::Tetracyclic aza-amide, 12h
SMILES COc1cc2CCN3C(C4CCCC(N4S(=O)(=O)c4ccccc4)C3=O)c2c(OC)c1
InChI Key InChIKey=GTKIJKRXGXRCQI-UHFFFAOYSA-N
Data  1 KI
  Tab Delimited (TSV)   2D SDfile   Computed 3D by Vconf -m prep SDfile
Find this compound or compounds like it in BindingDB:
Activity Spreadsheet -- Enzyme Inhibition Constant Data from BindingDB
Found 1 hit for monomerid = 23379
TargetPeptidyl-prolyl cis-trans isomerase FKBP1A(Bos taurus (bovine))
Pfizer
LigandPNGBDBM23379(17-(benzenesulfonyl)-4,6-dimethoxy-11,17-diazatetr...)
Affinity DataKi:  244nM. Assay description: PPIase(Rotamase) activity of FKBP12 was assayed using the peptide N-succinyl Ala-Leu-Pro-Phe p-nitroanilide as substrate. It is based on the observat...
In DepthDetails ArticlePubMed