BDBM233867 US9353081, 61
SMILES CN1C(=O)CCc2cc(ccc12)-c1cncc2[C@H](N)CCCc12
InChI Key InChIKey=PNXQJOWNYRUIIT-QGZVFWFLSA-N
Data  2 EC50
  Tab Delimited (TSV)   2D SDfile   Computed 3D by Vconf -m prep SDfile
Find this compound or compounds like it in BindingDB:
Activity Spreadsheet -- Enzyme Inhibition Constant Data from BindingDB
Found 2 hits for monomerid = 233867
TargetCytochrome P450 11B1, mitochondrial(Homo sapiens (Human))
Hoffmann-La Roche
US Patent
LigandPNGBDBM233867(US9353081, 61)
Affinity DataEC50:  450nMT: 2°C. Assay description: The expression plasmids contains the ORF for either human/cyno CYP11B1 or CYP11B2 under the control of a suitable promoter (CMV-promoter) and a suita...
Ligand InfoPC cidPC sid
In DepthDetails US Patent
TargetCytochrome P450 11B2, mitochondrial(Homo sapiens (Human))
Hoffmann-La Roche
US Patent
LigandPNGBDBM233867(US9353081, 61)
Affinity DataEC50:  5.60nMT: 2°C. Assay description: The expression plasmids contains the ORF for either human/cyno CYP11B1 or CYP11B2 under the control of a suitable promoter (CMV-promoter) and a suita...
Ligand InfoPC cidPC sid
In DepthDetails US Patent