BDBM234016 US9353090, 144
SMILES Cc1cccc(-c2csc(n2)N2C[C@@H]3C[C@@]3(C2)C(O)=O)c1OCc1ccc2CCN(CCc2c1C)C1CCOCC1
InChI Key InChIKey=ASGQRPCSDXFPEE-JQJBXXCASA-N
Data  1 EC50
  Tab Delimited (TSV)   2D SDfile   Computed 3D by Vconf -m prep SDfile
Find this compound or compounds like it in BindingDB:
Activity Spreadsheet -- Enzyme Inhibition Constant Data from BindingDB
Found 1 hit for monomerid = 234016
TargetGuanylate cyclase soluble subunit alpha-1/beta-1(Homo sapiens (Human))
Boehringer Ingelheim International
US Patent
LigandPNGBDBM234016(US9353090, 144)
Affinity DataEC50:  10nMT: 2°C. Assay description: The sGC cellular activator assay is performed in the presence and absence of 50% human serum (HS) using Chinese hamster ovary cells that have been st...
Ligand InfoPC cidPC sid
In DepthDetails US Patent