BDBM234043 US9353090, 171
SMILES CO[C@H]1CN(CC[C@H]1C(O)=O)c1nc(cs1)-c1cccc(C)c1OCc1cc2CCN(Cc2c(OC)c1)C1CCOCC1
InChI Key InChIKey=URGDCRXDFNCRJN-VIZCGCQYSA-N
Data  1 EC50
  Tab Delimited (TSV)   2D SDfile   Computed 3D by Vconf -m prep SDfile
Find this compound or compounds like it in BindingDB:
Activity Spreadsheet -- Enzyme Inhibition Constant Data from BindingDB
Found 1 hit for monomerid = 234043
TargetGuanylate cyclase soluble subunit alpha-1/beta-1(Homo sapiens (Human))
Boehringer Ingelheim International
US Patent
LigandPNGBDBM234043(US9353090, 171)
Affinity DataEC50:  10nMT: 2°C. Assay description: The sGC cellular activator assay is performed in the presence and absence of 50% human serum (HS) using Chinese hamster ovary cells that have been st...
Ligand InfoPC cidPC sid
In DepthDetails US Patent