BDBM234113 US9353090, 243
SMILES COC[C@H]1N(C[C@@H]2C[C@]12C(O)=O)c1cccc(n1)-c1cccc(C)c1OCc1cc(F)c2CCN(CCc2c1)C1CCOCC1
InChI Key InChIKey=BFWQRNKHXPCMSK-IQGXZWDMSA-N
Data  1 EC50
  Tab Delimited (TSV)   2D SDfile   Computed 3D by Vconf -m prep SDfile
Find this compound or compounds like it in BindingDB:
Activity Spreadsheet -- Enzyme Inhibition Constant Data from BindingDB
Found 1 hit for monomerid = 234113
TargetGuanylate cyclase soluble subunit alpha-1/beta-1(Homo sapiens (Human))
Boehringer Ingelheim International
US Patent
LigandPNGBDBM234113(US9353090, 243)
Affinity DataEC50:  3nMT: 2°C. Assay description: The sGC cellular activator assay is performed in the presence and absence of 50% human serum (HS) using Chinese hamster ovary cells that have been st...
Ligand InfoPC cidPC sid
In DepthDetails US Patent