BDBM234231 US9359330, 36
SMILES COc1ccc(cc1)C(=O)N1CCCC(C1)c1ccccc1-c1cnc(nc1)N(C)C
InChI Key InChIKey=JUZCSPMBSQLDCI-UHFFFAOYSA-N
Data  1 IC50
  Tab Delimited (TSV)   2D SDfile   Computed 3D by Vconf -m prep SDfile
Find this compound or compounds like it in BindingDB:
Activity Spreadsheet -- Enzyme Inhibition Constant Data from BindingDB
Found 1 hit for monomerid = 234231
TargetSodium channel protein type 9 subunit alpha(Homo sapiens (Human))
Purdue Pharma
US Patent
LigandPNGBDBM234231(US9359330, 36)
Affinity DataIC50:  384nMpH: 7.3Assay Description:The assay buffer was formulated by removing 120 mL from a 1 L bottle of fresh, sterile dH2O (Mediatech, Herndon, Va.) and adding 100 mL of 10×HBSS th...
Ligand InfoPC cidPC sid
In DepthDetails US Patent