BDBM23437 4-heptylbenzoate::benzoic acid derivative, 6
SMILES CCCCCCCc1ccc(cc1)C([O-])=O
InChI Key InChIKey=VSUKEWPHURLYTK-UHFFFAOYSA-M
Data  1 Kd
  Tab Delimited (TSV)   2D SDfile   Computed 3D by Vconf -m prep SDfile
Find this compound or compounds like it in BindingDB:
Activity Spreadsheet -- Enzyme Inhibition Constant Data from BindingDB
Found 1 hit for monomerid = 23437
TargetUDP-3-O-acyl-N-acetylglucosamine deacetylase(Aquifex aeolicus)
University Of San Francisco
LigandPNGBDBM23437(4-heptylbenzoate | benzoic acid derivative, 6)
Affinity DataKd:  3.50E+4nMpH: 7.0 T: 2°C. Assay description: Ligand binding to A. aeolicus LpxC was assayed by isothermal titration using isothermal microcalorimeter from Microcal, Inc. (Northampton, MA). The e...
In DepthDetails ArticlePubMed