BDBM234422 Ethyl 2-(2-((2S,3R)-2-(tert-butoxycarbonylamino)-3-methylpentanamido)thiazol-4-yl)acetate (5a)
SMILES CCOC(=O)Cc1csc(NC(=O)[C@@H](NC(=O)OC(C)(C)C)[C@H](C)CC)n1
InChI Key InChIKey=PAVAKGKCDNUFFP-RISCZKNCSA-N
Data  1 IC50
  Tab Delimited (TSV)   2D SDfile   Computed 3D by Vconf -m prep SDfile
Find this compound or compounds like it in BindingDB:
Activity Spreadsheet -- Enzyme Inhibition Constant Data from BindingDB
Found 1 hit for monomerid = 234422
TargetNeuraminidase(Influenza A virus H3N2)
Shandong University
LigandPNGBDBM234422(Ethyl 2-(2-((2S,3R)-2-(tert-butoxycarbonylamino)-3...)
Affinity DataIC50:  4.03E+4nM. Assay description: NA inhibitory activity was determined by the commercial NA inhibitory screening kit (Beyotime Institute of Biotechnology, Jiangsu, China). The reacti...
Ligand InfoPC cidPC sid
In DepthDetails ArticlePubMed