BDBM234435 (S)-Ethyl 2-(2-(2-amino-4-(methylthio)butanamido)thiazol-4-yl)acetate (8b)
SMILES CCOC(=O)Cc1csc(NC(=O)[C@@H](N)CCSC)n1
InChI Key InChIKey=KEYRMNMBOFKYMV-VIFPVBQESA-N
Data  1 IC50
  Tab Delimited (TSV)   2D SDfile   Computed 3D by Vconf -m prep SDfile
Find this compound or compounds like it in BindingDB:
Activity Spreadsheet -- Enzyme Inhibition Constant Data from BindingDB
Found 1 hit for monomerid = 234435
TargetNeuraminidase(Influenza A virus H3N2)
Shandong University
LigandPNGBDBM234435((S)-Ethyl 2-(2-(2-amino-4-(methylthio)butanamido)t...)
Affinity DataIC50:  4.52E+4nM. Assay description: NA inhibitory activity was determined by the commercial NA inhibitory screening kit (Beyotime Institute of Biotechnology, Jiangsu, China). The reacti...
Ligand InfoPC cidPC sid
In DepthDetails ArticlePubMed