BDBM234488 US10004738, 41::US9353084, 41
SMILES Cc1ccc(o1)C(=O)Nc1ccc(F)c(c1)[C@@]1(C)N=C(N)[C@](C)(F)CC1(F)F
InChI Key InChIKey=UMBJREUTONPUSK-QZTJIDSGSA-N
Data  2 KI
  Tab Delimited (TSV)   2D SDfile   Computed 3D by Vconf -m prep SDfile
Find this compound or compounds like it in BindingDB:
Activity Spreadsheet -- Enzyme Inhibition Constant Data from BindingDB
Found 2 hits for monomerid = 234488
TargetBeta-secretase 1(Homo sapiens (Human))
H. Lundbeck
US Patent
LigandPNGBDBM234488(US10004738, 41 | US9353084, 41)
Affinity DataKi:  520nM. Assay description: The binding assay was performed as SPA-based assay using a biotinylated form of human BACE1 recombinantly expressed and subsequently purified from Fr...
Ligand InfoPC cidPC sid
In DepthDetails US Patent
TargetBeta-secretase 1(Homo sapiens (Human))
H. Lundbeck
US Patent
LigandPNGBDBM234488(US10004738, 41 | US9353084, 41)
Affinity DataKi:  520nMpH: 4.5Assay Description:The binding assay was performed as SPA-based assay using a biotinylated form of human BACE1 recombinantly expressed and subsequently purified from Fr...
Ligand InfoPC cidPC sid
In DepthDetails US Patent