BDBM234561 US9353089, 334
SMILES COc1ccc(cc1)C1(NC(=N)N(C2CCOCC2)C1=O)c1ccncc1
InChI Key InChIKey=DCCXAQIUHNVRAJ-UHFFFAOYSA-N
Data  2 IC50
  Tab Delimited (TSV)   2D SDfile   Computed 3D by Vconf -m prep SDfile
Find this compound or compounds like it in BindingDB:
Activity Spreadsheet -- Enzyme Inhibition Constant Data from BindingDB
Found 2 hits for monomerid = 234561
TargetBeta-secretase 1(Homo sapiens (Human))
Saint Louis University
US Patent
LigandPNGBDBM234561(US9353089, 334)
Affinity DataIC50: >1.00E+4nMpH: 4.0 T: 2°C. Assay description: The recombinant human BACE1, Cathepsin D, and Cathepsin E enzymes were purchased from R&D Systems (catalog numbers are 931-AS, 1014AS and 1294AS, res...
Ligand InfoPC cidPC sid
In DepthDetails US Patent
TargetPlasmepsin II(Plasmodium falciparum)
Saint Louis University
US Patent
LigandPNGBDBM234561(US9353089, 334)
Affinity DataIC50:  85.9nMpH: 4.5 T: 2°C. Assay description: Plasmepsin-2 (PM-2; Plm II) and Plasmepsin (PM-4; Plm IV) expression and purification was performed following the published protocols (Istvan E S and...
Ligand InfoPC cidPC sid
In DepthDetails US Patent