BDBM23461 hydroxamate deriv., 53::methyl (1R,2R)-2-(hydroxycarbamoyl)-1-(3-methoxyphenyl)cyclopropane-1-carboxylate
SMILES COC(=O)[C@@]1(C[C@H]1C(=O)NO)c1cccc(OC)c1
InChI Key InChIKey=LVHUOQQHFDHTIE-GWCFXTLKSA-N
Data  1 KI
  Tab Delimited (TSV)   2D SDfile   Computed 3D by Vconf -m prep SDfile
Find this compound or compounds like it in BindingDB:
Activity Spreadsheet -- Enzyme Inhibition Constant Data from BindingDB
Found 1 hit for monomerid = 23461
TargetDisintegrin and metalloproteinase domain-containing protein 17 [215-477,S266A,N452Q](Homo sapiens (Human))
Schering-Plough Research Institute
LigandPNGBDBM23461(hydroxamate deriv., 53 | methyl (1R,2R)-2-(hydroxy...)
Affinity DataKi:  3.00E+3nM ΔG°:  -7.45kcal/molepH: 7.3 T: 2°C. Assay description: Enzyme activity was determined by a kinetic assay measuring the rate of increase in fluorescent intensity generated by the cleavage of an internally ...
In DepthDetails ArticlePubMed