BDBM234679 US9353102, 4.3
SMILES Cc1sc(NC(=O)C2=C(C3CCC2CC3)C(O)=O)c(-c2nc(no2)C2CC2)c1C1CC1
InChI Key InChIKey=RPHDYZRBTDLXFZ-UHFFFAOYSA-N
Data  2 IC50
  Tab Delimited (TSV)   2D SDfile   Computed 3D by Vconf -m prep SDfile
Find this compound or compounds like it in BindingDB:
Activity Spreadsheet -- Enzyme Inhibition Constant Data from BindingDB
Found 2 hits for monomerid = 234679
TargetFatty acid-binding protein 5(Homo sapiens (Human))
Hoffmann-La Roche
US Patent
LigandPNGBDBM234679(US9353102, 4.3)
Affinity DataIC50:  40nMpH: 7.5Assay Description:Stock DMSO solutions (1.8 mM) of compounds were serially diluted 3-fold for ten concentrations with 100% DMSO (50 μM to 0.003 μM final comp...
Ligand InfoPC cidPC sid
In DepthDetails US Patent
TargetFatty acid-binding protein, adipocyte(Homo sapiens (Human))
Hoffmann-La Roche
US Patent
LigandPNGBDBM234679(US9353102, 4.3)
Affinity DataIC50:  20nMpH: 7.5Assay Description:Stock DMSO solutions (1.8 mM) of compounds were serially diluted 3-fold for ten concentrations with 100% DMSO (50 μM to 0.003 μM final comp...
Ligand InfoPC cidPC sid
In DepthDetails US Patent