BDBM234717 US9353104, 5
SMILES Cc1nnc(CNc2cc(OC[C@H]3C[C@@H]3c3ccc(OC(F)F)cn3)nn(C)c2=O)s1
InChI Key InChIKey=GEUKVFCTVXQZGN-YPMHNXCESA-N
Data  1 KI
  Tab Delimited (TSV)   2D SDfile   Computed 3D by Vconf -m prep SDfile
Find this compound or compounds like it in BindingDB:
Activity Spreadsheet -- Enzyme Inhibition Constant Data from BindingDB
Found 1 hit for monomerid = 234717
LigandPNGBDBM234717(US9353104, 5)
Affinity DataKi:  0.157nM. Assay description: The fluorescence polarization assay for cyclic nucleotide phosphodiesterases was performed using an IMAP® FP kit supplied by Molecular Devices, Sunny...
Ligand InfoPC cidPC sid
In DepthDetails US Patent