BDBM234788 US9353104, 88
SMILES COc1ccc(nc1)[C@H]1C[C@@H]1COc1cc(NCc2nc(C)nn2C)c(=O)n(C)n1
InChI Key InChIKey=CRTLTLJNBWIXGV-HIFRSBDPSA-N
Data  1 KI
  Tab Delimited (TSV)   2D SDfile   Computed 3D by Vconf -m prep SDfile
Find this compound or compounds like it in BindingDB:
Activity Spreadsheet -- Enzyme Inhibition Constant Data from BindingDB
Found 1 hit for monomerid = 234788
LigandPNGBDBM234788(US9353104, 88)
Affinity DataKi:  2.80nM. Assay description: The fluorescence polarization assay for cyclic nucleotide phosphodiesterases was performed using an IMAP® FP kit supplied by Molecular Devices, Sunny...
Ligand InfoPC cidPC sid
In DepthDetails US Patent