BDBM234798 US9353104, 102
SMILES Cc1cc(C(=O)Nc2cc(OC[C@H]3C[C@@H]3c3ccc(C)cn3)nn(C)c2=O)n(C)n1
InChI Key InChIKey=FYZIVIWTMFEACT-CABCVRRESA-N
Data  1 KI
  Tab Delimited (TSV)   2D SDfile   Computed 3D by Vconf -m prep SDfile
Find this compound or compounds like it in BindingDB:
Activity Spreadsheet -- Enzyme Inhibition Constant Data from BindingDB
Found 1 hit for monomerid = 234798
LigandPNGBDBM234798(US9353104, 102)
Affinity DataKi:  51.2nM. Assay description: The fluorescence polarization assay for cyclic nucleotide phosphodiesterases was performed using an IMAP® FP kit supplied by Molecular Devices, Sunny...
Ligand InfoPC cidPC sid
In DepthDetails US Patent