BDBM234802 US9353104, 106
SMILES CCn1ccc(CNc2cc(OC[C@H]3C[C@@H]3c3ccc(OC)cn3)nn(C)c2=O)n1
InChI Key InChIKey=CEUOLVYOOGKTMA-PBHICJAKSA-N
Data  1 KI
  Tab Delimited (TSV)   2D SDfile   Computed 3D by Vconf -m prep SDfile
Find this compound or compounds like it in BindingDB:
Activity Spreadsheet -- Enzyme Inhibition Constant Data from BindingDB
Found 1 hit for monomerid = 234802
LigandPNGBDBM234802(US9353104, 106)
Affinity DataKi:  5.89nM. Assay description: The fluorescence polarization assay for cyclic nucleotide phosphodiesterases was performed using an IMAP® FP kit supplied by Molecular Devices, Sunny...
Ligand InfoPC cidPC sid
In DepthDetails US Patent