BDBM234806 US9353104, 110
SMILES Cc1ncc(CNc2cc(OC[C@@H]3C[C@H]3c3nn(C)c4ccccc34)nn(C)c2=O)s1
InChI Key InChIKey=BXMROPXPUWPRQE-WMLDXEAASA-N
Data  1 KI
  Tab Delimited (TSV)   2D SDfile   Computed 3D by Vconf -m prep SDfile
Find this compound or compounds like it in BindingDB:
Activity Spreadsheet -- Enzyme Inhibition Constant Data from BindingDB
Found 1 hit for monomerid = 234806
LigandPNGBDBM234806(US9353104, 110)
Affinity DataKi:  0.0770nM. Assay description: The fluorescence polarization assay for cyclic nucleotide phosphodiesterases was performed using an IMAP® FP kit supplied by Molecular Devices, Sunny...
Ligand InfoPC cidPC sid
In DepthDetails US Patent