BDBM234834 US9353104, 139
SMILES CCc1cc(CNc2cc(OC[C@H]3C[C@@H]3c3ccn(C)n3)nn(C)c2=O)n(C)n1
InChI Key InChIKey=VLVNOGWBAUUPFZ-CJNGLKHVSA-N
Data  1 KI
  Tab Delimited (TSV)   2D SDfile   Computed 3D by Vconf -m prep SDfile
Find this compound or compounds like it in BindingDB:
Activity Spreadsheet -- Enzyme Inhibition Constant Data from BindingDB
Found 1 hit for monomerid = 234834
LigandPNGBDBM234834(US9353104, 139)
Affinity DataKi:  0.295nM. Assay description: The fluorescence polarization assay for cyclic nucleotide phosphodiesterases was performed using an IMAP® FP kit supplied by Molecular Devices, Sunny...
Ligand InfoPC cidPC sid
In DepthDetails US Patent