BDBM234837 US9353104, 142
SMILES COc1ccc(Cn2nc(OC[C@H]3C[C@@H]3c3ccc(OC)cn3)cc(NCc3nnc(C)s3)c2=O)cc1
InChI Key InChIKey=NSLMVSOJXHIYJG-NQIIRXRSSA-N
Data  1 KI
  Tab Delimited (TSV)   2D SDfile   Computed 3D by Vconf -m prep SDfile
Find this compound or compounds like it in BindingDB:
Activity Spreadsheet -- Enzyme Inhibition Constant Data from BindingDB
Found 1 hit for monomerid = 234837
LigandPNGBDBM234837(US9353104, 142)
Affinity DataKi:  75nM. Assay description: The fluorescence polarization assay for cyclic nucleotide phosphodiesterases was performed using an IMAP® FP kit supplied by Molecular Devices, Sunny...
Ligand InfoPC cidPC sid
In DepthDetails US Patent