BDBM234880 US9359337, 11
SMILES CC(C)N(CC(=O)NC[C@H]1CN(CCO1)c1ccc(cc1)C(F)(F)F)S(=O)(=O)c1ccc(F)cc1
InChI Key InChIKey=BPKDWFGRTCABEJ-FQEVSTJZSA-N
Data  1 IC50
  Tab Delimited (TSV)   2D SDfile   Computed 3D by Vconf -m prep SDfile
Find this compound or compounds like it in BindingDB:
Activity Spreadsheet -- Enzyme Inhibition Constant Data from BindingDB
Found 1 hit for monomerid = 234880
TargetTransient receptor potential cation channel subfamily A member 1(Homo sapiens (Human))
Hoffmann-La Roche
US Patent
LigandPNGBDBM234880(US9359337, 11)
Affinity DataIC50:  151nMT: 2°C. Assay description: Compound plates were resuspended with 100 ul of HBSS/20 mM HEPES/0.005% BSA buffer (Compound Buffer): column 1A-H: buffer/DMSO (bk); column 2A-H: AP-...
Ligand InfoPC cidPC sid
In DepthDetails US Patent