BDBM234944 US9556143, 30
SMILES CCOCCCc1ccc(nc1)C(F)(F)C(O)(Cn1cnnn1)c1ccc(F)cc1F
InChI Key InChIKey=WDVIOEKUYYWZNP-UHFFFAOYSA-N
Data  3 IC50
  Tab Delimited (TSV)   2D SDfile   Computed 3D by Vconf -m prep SDfile
Find this compound or compounds like it in BindingDB:
Activity Spreadsheet -- Enzyme Inhibition Constant Data from BindingDB
Found 3 hits for monomerid = 234944
TargetCytochrome P450 2C9(Homo sapiens (Human))
Viamet Pharmaceuticals
US Patent
LigandPNGBDBM234944(US9556143, 30)
Affinity DataIC50:  4.20E+4nM. Assay description: Solutions of each test compound were separately prepared at concentrations of 20000, 6000, 2000, 600, 200, and 60 μM by serial dilution with DMS...
Ligand InfoPC cidPC sid
In DepthDetails US Patent
TargetCytochrome P450 3A4(Homo sapiens (Human))
Viamet Pharmaceuticals
US Patent
LigandPNGBDBM234944(US9556143, 30)
Affinity DataIC50:  1.70E+4nM
Ligand InfoPC cidPC sid
In DepthDetails US Patent
TargetCytochrome P450 2C19(Homo sapiens (Human))
Viamet Pharmaceuticals
US Patent
LigandPNGBDBM234944(US9556143, 30)
Affinity DataIC50:  5.30E+4nM
Ligand InfoPC cidPC sid
In DepthDetails US Patent