BDBM235000 US9556168, 1AA
SMILES OC(=O)c1ccc(cc1O)-c1nn(Cc2c(Cl)cccc2C(F)(F)F)c2ccccc12
InChI Key InChIKey=AFVOPYQPKVJNRT-UHFFFAOYSA-N
Data  1 IC50
  Tab Delimited (TSV)   2D SDfile   Computed 3D by Vconf -m prep SDfile
Find this compound or compounds like it in BindingDB:
Activity Spreadsheet -- Enzyme Inhibition Constant Data from BindingDB
Found 1 hit for monomerid = 235000
TargetNuclear receptor ROR-gamma(Homo sapiens (Human))
Merck Sharp & Dohme
US Patent
LigandPNGBDBM235000(US9556168, 1AA)
Affinity DataIC50:  4nMpH: 7.0Assay Description:The compounds of the invention inhibit RORgammaT activity. Activation of RORgammaT activity can be measured using, e.g., biochemical TR-FRET assay. I...
Ligand InfoPC cidPC sid
In DepthDetails US Patent