BDBM235133 US9359339, 19
SMILES CCC[C@@H](C(c1c(C)sc2c(cc(Cl)cc12)C#N)c1ccc(Cl)cc1)c1ccc(cc1)C(=O)NCCC(O)=O
InChI Key InChIKey=IJVMJWMXQKUNRV-MIJJZIGMSA-N
Data  1 IC50
  Tab Delimited (TSV)   2D SDfile   Computed 3D by Vconf -m prep SDfile
Find this compound or compounds like it in BindingDB:
Activity Spreadsheet -- Enzyme Inhibition Constant Data from BindingDB
Found 1 hit for monomerid = 235133
TargetGlucagon receptor(Homo sapiens (Human))
Merck Sharp & Dohme
US Patent
LigandPNGBDBM235133(US9359339, 19)
Affinity DataIC50:  7.80nMpH: 7.5 T: 2°C. Assay description: A stable CHO (Chinese hamster ovary) cell line expressing cloned human glucagon receptor was maintained as described (Chicchi, et. al. J Biol Chem 27...
Ligand InfoPC cidPC sid
In DepthDetails US Patent